Target
DNA-dependent protein kinase catalytic subunit
Ligand
BDBM50245660
Substrate
Meas. Tech.
ChEMBL_512869 (CHEMBL972582)
IC50
490±n/a nM
Citation
 Desage-El Murr, MCano, CGolding, BTHardcastle, IRHummersome, MFrigerio, MCurtin, NJMenear, KRichardson, CSmith, GCGriffin, RJ 8-Biarylchromen-4-one inhibitors of the DNA-dependent protein kinase (DNA-PK). Bioorg Med Chem Lett 18:4885-90 (2008)  
Target
Name:
DNA-dependent protein kinase catalytic subunit
Synonyms:
DNA-PK catalytic subunit DNA-dependent protein kinase (DNA-PK) DNA-dependent protein kinase catalytic subunit (DNA-PK) HYRC PRKDC | PRKDC_HUMAN
Type:
Protein
Mol. Mass.:
469114.78
Organism:
Homo sapiens (Human)
Description:
P78527
Residue:
4128
  
Inhibitor
Name:
BDBM50245660
Synonyms:
2-morpholino-8-(3-(thiazol-2-yl)phenyl)-4H-chromen-4-one | CHEMBL488903
Type:
Small organic molecule
Emp. Form.:
C22H18N2O3S
Mol. Mass.:
390.455
SMILES:
O=c1cc(oc2c(cccc12)-c1cccc(c1)-c1nccs1)N1CCOCC1
: