Target
DNA-dependent protein kinase catalytic subunit
Ligand
BDBM50245327
Substrate
Meas. Tech.
ChEMBL_512869 (CHEMBL972582)
IC50
4450±n/a nM
Citation
 Desage-El Murr, MCano, CGolding, BTHardcastle, IRHummersome, MFrigerio, MCurtin, NJMenear, KRichardson, CSmith, GCGriffin, RJ 8-Biarylchromen-4-one inhibitors of the DNA-dependent protein kinase (DNA-PK). Bioorg Med Chem Lett 18:4885-90 (2008)  
Target
Name:
DNA-dependent protein kinase catalytic subunit
Synonyms:
DNA-PK catalytic subunit DNA-dependent protein kinase (DNA-PK) DNA-dependent protein kinase catalytic subunit (DNA-PK) HYRC PRKDC | PRKDC_HUMAN
Type:
Protein
Mol. Mass.:
469114.78
Organism:
Homo sapiens (Human)
Description:
P78527
Residue:
4128
  
Inhibitor
Name:
BDBM50245327
Synonyms:
8-(2-(isoquinolin-5-yl)pyridin-4-yl)-2-(piperidin-1-yl)-4H-chromen-4-one | CHEMBL462201
Type:
Small organic molecule
Emp. Form.:
C28H23N3O2
Mol. Mass.:
433.5011
SMILES:
O=c1cc(oc2c(cccc12)-c1ccnc(c1)-c1cccc2cnccc12)N1CCCCC1
: