Target
DNA-dependent protein kinase catalytic subunit
Ligand
BDBM50245531
Substrate
Meas. Tech.
ChEMBL_512869 (CHEMBL972582)
IC50
1000±n/a nM
Citation
 Desage-El Murr, MCano, CGolding, BTHardcastle, IRHummersome, MFrigerio, MCurtin, NJMenear, KRichardson, CSmith, GCGriffin, RJ 8-Biarylchromen-4-one inhibitors of the DNA-dependent protein kinase (DNA-PK). Bioorg Med Chem Lett 18:4885-90 (2008)  
Target
Name:
DNA-dependent protein kinase catalytic subunit
Synonyms:
DNA-PK catalytic subunit DNA-dependent protein kinase (DNA-PK) DNA-dependent protein kinase catalytic subunit (DNA-PK) HYRC PRKDC | PRKDC_HUMAN
Type:
Protein
Mol. Mass.:
469114.78
Organism:
Homo sapiens (Human)
Description:
P78527
Residue:
4128
  
Inhibitor
Name:
BDBM50245531
Synonyms:
8-(4'-(hydroxymethyl)biphenyl-3-yl)-2-morpholino-4H-chromen-4-one | CHEMBL488023
Type:
Small organic molecule
Emp. Form.:
C26H23NO4
Mol. Mass.:
413.4651
SMILES:
OCc1ccc(cc1)-c1cccc(c1)-c1cccc2c1oc(cc2=O)N1CCOCC1
: