Target
DNA-dependent protein kinase catalytic subunit
Ligand
BDBM50245756
Substrate
Meas. Tech.
ChEMBL_512869 (CHEMBL972582)
IC50
710±n/a nM
Citation
 Desage-El Murr, MCano, CGolding, BTHardcastle, IRHummersome, MFrigerio, MCurtin, NJMenear, KRichardson, CSmith, GCGriffin, RJ 8-Biarylchromen-4-one inhibitors of the DNA-dependent protein kinase (DNA-PK). Bioorg Med Chem Lett 18:4885-90 (2008)  
Target
Name:
DNA-dependent protein kinase catalytic subunit
Synonyms:
DNA-PK catalytic subunit DNA-dependent protein kinase (DNA-PK) DNA-dependent protein kinase catalytic subunit (DNA-PK) HYRC PRKDC | PRKDC_HUMAN
Type:
Protein
Mol. Mass.:
469114.78
Organism:
Homo sapiens (Human)
Description:
P78527
Residue:
4128
  
Inhibitor
Name:
BDBM50245756
Synonyms:
8-(5-(isoquinolin-5-yl)thiophen-2-yl)-2-(piperidin-1-yl)-4H-chromen-4-one | CHEMBL454429
Type:
Small organic molecule
Emp. Form.:
C27H22N2O2S
Mol. Mass.:
438.541
SMILES:
O=c1cc(oc2c(cccc12)-c1ccc(s1)-c1cccc2cnccc12)N1CCCCC1
: