Target
Delta-type opioid receptor
Ligand
BDBM50272228
Substrate
Meas. Tech.
ChEMBL_510432 (CHEMBL1003108)
Ki
0.07±n/a nM
Citation
 Balboni, GFiorini, SBaldisserotto, ATrapella, CSasaki, YAmbo, AMarczak, EDLazarus, LHSalvadori, S Further studies on lead compounds containing the opioid pharmacophore Dmt-Tic. J Med Chem 51:5109-17 (2008)  
Target
Name:
Delta-type opioid receptor
Synonyms:
Cytochrome P450 3A4 Delta opioid receptor Delta-type opioid receptor (DOR) OPRD_RAT Opioid receptor Opioid receptors; mu & delta Ror-a | Voltage-gated potassium channel
Type:
G Protein-Coupled Receptor (GPCR)
Mol. Mass.:
40465.04
Organism:
Rattus norvegicus (rat)
Description:
Competition binding assays were using CHO-K1 cell membranes expressing the opioid receptor.
Residue:
372
  
Inhibitor
Name:
BDBM50272228
Synonyms:
CHEMBL499099 | H-Dmt-Tic-NH-(R)CH(CH2-COOH)-Bid(N1-Me)
Type:
Small organic molecule
Emp. Form.:
C32H35N5O5
Mol. Mass.:
569.6508
SMILES:
Cc1cc(O)cc(C)c1C[C@H](N)C(=O)N1Cc2ccccc2C[C@H]1C(=O)N[C@H](CC(O)=O)c1nc2ccccc2n1C
: