Target
C-C chemokine receptor type 4
Ligand
BDBM50245036
Substrate
Meas. Tech.
ChEMBL_512157 (CHEMBL980951)
IC50
130±n/a nM
Citation
 Yokoyama, KIshikawa, NIgarashi, SKawano, NMasuda, NHattori, KMiyazaki, TOgino, SOrita, MMatsumoto, YTakeuchi, MOhta, M Potent CCR4 antagonists: synthesis, evaluation, and docking study of 2,4-diaminoquinazolines. Bioorg Med Chem 16:7968-74 (2008)  
Target
Name:
C-C chemokine receptor type 4
Synonyms:
C-C CKR-4 CCR-4 CD_antigen=CD194 Cmkbr4
Type:
PROTEIN
Mol. Mass.:
41410.76
Organism:
Mus musculus
Description:
ChEMBL_512157
Residue:
360
  
Inhibitor
Name:
BDBM50245036
Synonyms:
CHEMBL486840 | N-(4-Chlorophenyl)-6,7-dimethoxy-2-(4-pyrrolidin-1-ylpiperidin-1-yl)quinazolin-4-amine
Type:
Small organic molecule
Emp. Form.:
C25H30ClN5O2
Mol. Mass.:
467.991
SMILES:
COc1cc2nc(nc(Nc3ccc(Cl)cc3)c2cc1OC)N1CCC(CC1)N1CCCC1
: