Target
Peroxisome proliferator-activated receptor delta
Ligand
BDBM50244611
Substrate
Meas. Tech.
ChEMBL_512450 (CHEMBL980791)
IC50
>50000±n/a nM
Citation
 Debenham, SDChan, ALau, FWLiu, WWood, HBLemme, KColwell, LHabulihaz, BAkiyama, TEEinstein, MDoebber, TWSharma, NWang, CFWu, MBerger, JPMeinke, PT Highly functionalized 7-azaindoles as selective PPAR gamma modulators. Bioorg Med Chem Lett 18:4798-801 (2008)  
Target
Name:
Peroxisome proliferator-activated receptor delta
Synonyms:
NR1C2 NUCI Nuclear receptor subfamily 1 group C member 2 PPAR-beta PPARD Peroxisome proliferator-activated receptor Peroxisome proliferator-activated receptor delta
Type:
Enzyme
Mol. Mass.:
49910.45
Organism:
Homo sapiens (Human)
Description:
Q03181
Residue:
441
  
Inhibitor
Name:
BDBM50244611
Synonyms:
(S)-2-(4-chloro-3-((3-(4-chlorophenoxy)-2-methyl-1H-pyrrolo[2,3-b]pyridin-1-yl)methyl)phenoxy)propanoic acid | CHEMBL452054
Type:
Small organic molecule
Emp. Form.:
C24H20Cl2N2O4
Mol. Mass.:
471.333
SMILES:
C[C@H](Oc1ccc(Cl)c(Cn2c(C)c(Oc3ccc(Cl)cc3)c3cccnc23)c1)C(O)=O
: