Target
Peroxisome proliferator-activated receptor gamma
Ligand
BDBM50244611
Substrate
Meas. Tech.
ChEMBL_512441 (CHEMBL980782)
IC50
25±n/a nM
Citation
 Debenham, SDChan, ALau, FWLiu, WWood, HBLemme, KColwell, LHabulihaz, BAkiyama, TEEinstein, MDoebber, TWSharma, NWang, CFWu, MBerger, JPMeinke, PT Highly functionalized 7-azaindoles as selective PPAR gamma modulators. Bioorg Med Chem Lett 18:4798-801 (2008)  
Target
Name:
Peroxisome proliferator-activated receptor gamma
Synonyms:
NR1C3 PPAR-gamma PPARG_HUMAN Peroxisome proliferator-activated receptor gamma (PPAR gamma) Peroxisome proliferator-activated receptor gamma (PPARĪ³) peroxisome proliferator-activated receptor gamma isoform 2
Type:
Nuclear Receptor
Mol. Mass.:
57613.46
Organism:
Homo sapiens (Human)
Description:
P37231
Residue:
505
  
Inhibitor
Name:
BDBM50244611
Synonyms:
(S)-2-(4-chloro-3-((3-(4-chlorophenoxy)-2-methyl-1H-pyrrolo[2,3-b]pyridin-1-yl)methyl)phenoxy)propanoic acid | CHEMBL452054
Type:
Small organic molecule
Emp. Form.:
C24H20Cl2N2O4
Mol. Mass.:
471.333
SMILES:
C[C@H](Oc1ccc(Cl)c(Cn2c(C)c(Oc3ccc(Cl)cc3)c3cccnc23)c1)C(O)=O
: