Target
Cannabinoid receptor 1
Ligand
BDBM50246588
Substrate
Meas. Tech.
ChEMBL_557771 (CHEMBL953280)
Ki
325±n/a nM
Citation
 Yao, FLi, CVadivel, SKBowman, ALMakriyannis, A Development of novel tail-modified anandamide analogs. Bioorg Med Chem Lett 18:5912-5 (2008)  
Target
Name:
Cannabinoid receptor 1
Synonyms:
Brain-type cannabinoid receptor CB-R CNR1_RAT Cannabinoid receptor Cnr1 | Skr6
Type:
G Protein-Coupled Receptor (GPCR)
Mol. Mass.:
52856.55
Organism:
Rattus norvegicus (rat)
Description:
P20272
Residue:
473
  
Inhibitor
Name:
BDBM50246588
Synonyms:
(R,5Z,8Z,11Z,14Z)-19-(furan-2-yl)-N-(1-hydroxypropan-2-yl)nonadeca-5,8,11,14-tetraenamide | CHEMBL516663
Type:
Small organic molecule
Emp. Form.:
C26H39NO3
Mol. Mass.:
413.5928
SMILES:
C[C@H](CO)NC(=O)CCC\C=C/C\C=C/C\C=C/C\C=C/CCCCc1ccco1
: