Target
Melanocyte-stimulating hormone receptor
Ligand
BDBM50253740
Substrate
Meas. Tech.
ChEMBL_538609 (CHEMBL1027399)
Ki
637±n/a nM
Citation
 Tian, XSwitzer, AGDerose, SAMishra, RKSolinsky, MGMumin, RNEbetino, FHJayasinghe, LRWebster, MEColson, AOCrossdoersen, DPinney, BBFarmer, JADowty, MEObringer, CMCruze, CABurklow, MLSuchanek, PMDong, LDirr, MKSheldon, RJWos, JA Discovery of orally bioavailable 1,3,4-trisubstituted 2-oxopiperazine-based melanocortin-4 receptor agonists as potential antiobesity agents. J Med Chem 51:6055-66 (2008)  
Target
Name:
Melanocyte-stimulating hormone receptor
Synonyms:
MC1-R MSH-R MSHR_HUMAN Melanocortin receptor (M1 and M4) Melanocortin receptor 1 (MC1-R) | Melanocortin receptor 1 (MC1R)
Type:
Enzyme
Mol. Mass.:
34717.23
Organism:
Homo sapiens (Human)
Description:
Q01726
Residue:
317
  
Inhibitor
Name:
BDBM50253740
Synonyms:
CHEMBL448337 | N-((R)-3-(4-Fluorophenyl)-1-((S)-4-((S)-1-(methylamino)-3-(naphthalen-2-yl)-1-oxopropan-2-yl)-3-oxo-2-propylpiperazin-1-yl)-1-oxopropan-2-yl)picolinamide
Type:
Small organic molecule
Emp. Form.:
C36H38FN5O4
Mol. Mass.:
623.7164
SMILES:
CCC[C@@H]1N(CCN([C@@H](Cc2ccc3ccccc3c2)C(=O)NC)C1=O)C(=O)[C@@H](Cc1ccc(F)cc1)NC(=O)c1ccccn1
: