Target
5-hydroxytryptamine receptor 2A
Ligand
BDBM50050467
Substrate
Meas. Tech.
ChEMBL_538663 (CHEMBL1033061)
Ki
695±n/a nM
Citation
 Paul, NMTaylor, MKumar, RDeschamps, JRLuedtke, RRNewman, AH Structure-activity relationships for a novel series of dopamine D2-like receptor ligands based on N-substituted 3-aryl-8-azabicyclo[3.2.1]octan-3-ol. J Med Chem 51:6095-109 (2008)  
Target
Name:
5-hydroxytryptamine receptor 2A
Synonyms:
5-HT-2 5-HT2A 5-hydroxytryptamine receptor 2A (5HT-2A) 5HT2A_HUMAN HTR2A | Serotonin receptor 2A
Type:
undefined
Mol. Mass.:
52607.65
Organism:
Homo sapiens (Human)
Description:
P28223
Residue:
471
  
Inhibitor
Name:
BDBM50050467
Synonyms:
1-((1H-indol-3-yl)methyl)-4-(4-chlorophenyl)piperidin-4-ol 4-(4-Chloro-phenyl)-1-(1H-indol-3-ylmethyl)-piperidin-4-ol L-741626 | L741,626
Type:
Small organic molecule
Emp. Form.:
C20H21ClN2O
Mol. Mass.:
340.847
SMILES:
OC1(CCN(Cc2c[nH]c3ccccc23)CC1)c1ccc(Cl)cc1
: