Target
Melatonin receptor type 1B
Ligand
BDBM50263659
Substrate
Meas. Tech.
ChEMBL_535636 (CHEMBL987964)
Ki
0.36±n/a nM
Citation
 Poissonnier-Durieux, SEttaoussi, MPérès, BBoutin, JAAudinot, VBennejean, CDelagrange, PCaignard, DHRenard, PBerthelot, PLesieur, DYous, S Synthesis of 3-phenylnaphthalenic derivatives as new selective MT(2) melatoninergic ligands. Bioorg Med Chem 16:8339-48 (2008)  
Target
Name:
Melatonin receptor type 1B
Synonyms:
MTNR1B Mel-1B-R Melatonin 1B Melatonin receptor type 1B | Melatonin receptor type 2 (MT2)
Type:
Enzyme
Mol. Mass.:
40203.54
Organism:
Homo sapiens (Human)
Description:
P49286
Residue:
362
  
Inhibitor
Name:
BDBM50263659
Synonyms:
CHEMBL476131 | N-[2-(3-(3-hydroxymethylphenyl)-7-methoxynaphth-1-yl)ethyl] acetamide
Type:
Small organic molecule
Emp. Form.:
C22H23NO3
Mol. Mass.:
349.4229
SMILES:
COc1ccc2cc(cc(CCNC(C)=O)c2c1)-c1cccc(CO)c1
: