Target
Alpha-2A adrenergic receptor
Ligand
BDBM50263673
Substrate
Meas. Tech.
ChEMBL_535911 (CHEMBL984463)
Ki
48±n/a nM
Citation
 Patel, SDHabeski, WMMin, HZhang, JRoof, RSnyder, BBora, GCampbell, BLi, CHidayetoglu, DJohnson, DSChaudhry, ACharlton, MEKablaoui, NM Identification and SAR around N-{2-[4-(2,3-dihydro-benzo[1,4]dioxin-2-ylmethyl)-[1,4]diazepan-1-yl]-ethyl}-2-phenoxy-nicotinamide, a selective alpha2C adrenergic receptor antagonist. Bioorg Med Chem Lett 18:5689-93 (2008)  
Target
Name:
Alpha-2A adrenergic receptor
Synonyms:
ADA2A_HUMAN ADRA2R Adrenergic alpha2A Alpha-2 adrenergic receptor subtype C10 Alpha-2A adrenoreceptor alpha-2A adrenergic receptor [Homo sapiens]
Type:
Enzyme
Mol. Mass.:
48979.91
Organism:
Homo sapiens (Human)
Description:
P08913
Residue:
450
  
Inhibitor
Name:
BDBM50263673
Synonyms:
6-butoxy-N-(2-(4-((2,3-dihydrobenzo[b][1,4]dioxin-2-yl)methyl)-1,4-diazepan-1-yl)ethyl)picolinamide | CHEMBL476569
Type:
Small organic molecule
Emp. Form.:
C26H36N4O4
Mol. Mass.:
468.5884
SMILES:
CCCCOc1cccc(n1)C(=O)NCCN1CCCN(CC2COc3ccccc3O2)CC1
: