Target
D(2) dopamine receptor
Ligand
BDBM50253133
Substrate
Meas. Tech.
ChEMBL_539776 (CHEMBL1034994)
Ki
33±n/a nM
Citation
 Leopoldo, MLacivita, EDe Giorgio, PFracasso, CGuzzetti, SCaccia, SContino, MColabufo, NABerardi, FPerrone, R Structural modifications of N-(1,2,3,4-tetrahydronaphthalen-1-yl)-4-aryl-1-piperazinehexanamides: influence on lipophilicity and 5-HT7 receptor activity. Part III. J Med Chem 51:5813-22 (2008)  
Target
Name:
D(2) dopamine receptor
Synonyms:
D(2) dopamine receptor DOPAMINE D2 Long DRD2 Dopamine D2 receptor Dopamine D2 receptor (D2R) Dopamine2-like | d2
Type:
Cell-surface receptors
Mol. Mass.:
50647.10
Organism:
Homo sapiens (Human)
Description:
P14416
Residue:
443
  
Inhibitor
Name:
BDBM50253133
Synonyms:
CHEMBL492691 | N-Benzyl-4-(2-methylthiophenyl)-1-piperazinehexanamide
Type:
Small organic molecule
Emp. Form.:
C24H33N3OS
Mol. Mass.:
411.603
SMILES:
CSc1ccccc1N1CCN(CCCCCC(=O)NCc2ccccc2)CC1
: