Target
Cholinesterase
Ligand
BDBM50252787
Substrate
Meas. Tech.
ChEMBL_534768 (CHEMBL986292)
IC50
359±n/a nM
Citation
 Carolan, CGDillon, GPGaynor, JMReidy, SRyder, SAKhan, DMarquez, JFGilmer, JF Isosorbide-2-carbamate esters: potent and selective butyrylcholinesterase inhibitors. J Med Chem 51:6400-9 (2008)  
Target
Name:
Cholinesterase
Synonyms:
Acylcholine acylhydrolase Butyrylcholine esterase (BChE) Butyrylcholinesterase (BuChE) CHLE_HUMAN Cholinesterases Pseudocholinesterase
Type:
Homotetramer
Mol. Mass.:
68422.27
Organism:
Homo sapiens (Human)
Description:
P06276
Residue:
602
  
Inhibitor
Name:
BDBM50252787
Synonyms:
CHEMBL492636 | Isosorbide-2-benzylcarbamate-5-triflate
Type:
Small organic molecule
Emp. Form.:
C16H16F3NO9S
Mol. Mass.:
455.36
SMILES:
FC(F)(F)S(=O)(=O)OC(=O)O[C@@H]1CO[C@@H]2[C@H](CO[C@H]12)OC(=O)NCc1ccccc1
: