Target
Acetylcholinesterase
Ligand
BDBM50252741
Substrate
Meas. Tech.
ChEMBL_534770 (CHEMBL986294)
IC50
9900±n/a nM
Citation
 Carolan, CGDillon, GPGaynor, JMReidy, SRyder, SAKhan, DMarquez, JFGilmer, JF Isosorbide-2-carbamate esters: potent and selective butyrylcholinesterase inhibitors. J Med Chem 51:6400-9 (2008)  
Target
Name:
Acetylcholinesterase
Synonyms:
ACES_ELEEL Acetylcholinesterase (EeAChE) | ache
Type:
Enzyme
Mol. Mass.:
71812.79
Organism:
Electrophorus electricus (Electric eel)
Description:
Residue:
633
  
Inhibitor
Name:
BDBM50252741
Synonyms:
CHEMBL493458 | Isosorbide-2-(3,4-dichlorophenylcarbamate)-5-mononitrate
Type:
Small organic molecule
Emp. Form.:
C13H12Cl2N2O7
Mol. Mass.:
379.15
SMILES:
[O-][N+](=O)O[C@@H]1CO[C@@H]2[C@H](CO[C@H]12)OC(=O)Nc1ccc(Cl)c(Cl)c1
: