Target
Carbonic anhydrase 1
Ligand
BDBM22360
Substrate
Meas. Tech.
ChEMBL_497171 (CHEMBL1002071)
Ki
7530000±n/a nM
Citation
 Bayram, ESenturk, MKufrevioglu, OISupuran, CT In vitro inhibition of salicylic acid derivatives on human cytosolic carbonic anhydrase isozymes I and II. Bioorg Med Chem 16:9101-5 (2008)  
Target
Name:
Carbonic anhydrase 1
Synonyms:
CA-I CAB Carbonate dehydratase I Carbonic anhydrase 1 (CA I) Carbonic anhydrase 1 (Recombinant CA I) Carbonic anhydrase B Carbonic anhydrase I (CA I) Carbonic anhydrase I (CAI) Carbonic anhydrase isoenzyme I (hCA I) | hCA
Type:
Enzyme
Mol. Mass.:
28873.37
Organism:
Homo sapiens (Human)
Description:
P00915
Residue:
261
  
Inhibitor
Name:
BDBM22360
Synonyms:
2-(acetyloxy)benzoate Acetylsalicylic acid Endosprin Zorprin cid_2244
Type:
Anti-Inflammatory Agents, Non-Steroidal
Emp. Form.:
C9H8O4
Mol. Mass.:
180.1574
SMILES:
CC(=O)Oc1ccccc1C(O)=O
: