Target
Sodium-dependent serotonin transporter
Ligand
BDBM50274953
Substrate
Meas. Tech.
ChEMBL_493415 (CHEMBL944372)
Ki
0.4±n/a nM
Citation
 Bannwart, LMCarter, DSCai, HYChoy, JCGreenhouse, RJaime-Figueroa, SIyer, PSLin, CJLee, EKLucas, MCLynch, SMMadera, AMMoore, AOzboya, KRaptova, LRoetz, RSchoenfeld, RCStein, KASteiner, SVilla, MWeikert, RJZhai, Y Novel 3,3-disubstituted pyrrolidines as selective triple serotonin/norepinephrine/dopamine reuptake inhibitors. Bioorg Med Chem Lett 18:6062-6 (2008)  
Target
Name:
Sodium-dependent serotonin transporter
Synonyms:
5-HT Transporter 5HTT SC6A4_HUMAN SLC6A4 Serotonin transporter (5HTT) Sodium-dependent serotonin transporter (SERT) | Solute carrier family 6 member 4
Type:
Multi-pass membrane protein
Mol. Mass.:
70322.51
Organism:
Homo sapiens (Human)
Description:
P31645
Residue:
630
  
Inhibitor
Name:
BDBM50274953
Synonyms:
5-(3-benzylpyrrolidin-3-yl)-1H-indole-2-carbonitrile | CHEMBL457930
Type:
Small organic molecule
Emp. Form.:
C20H19N3
Mol. Mass.:
301.385
SMILES:
N#Cc1cc2cc(ccc2[nH]1)C1(Cc2ccccc2)CCNC1
: