Target
Nociceptin receptor
Ligand
BDBM50245974
Substrate
Meas. Tech.
ChEMBL_559154 (CHEMBL1012099)
EC50
124±n/a nM
Citation
 Yang, SWHo, GTulshian, DGreenlee, WJFernandez, XMcLeod, RLEckel, SAnthes, J Structure-activity relationships of 3-substituted N-benzhydryl-nortropane analogs as nociceptin receptor ligands for the treatment of cough. Bioorg Med Chem Lett 18:6340-3 (2008)  
Target
Name:
Nociceptin receptor
Synonyms:
KOR-3 Mu-type opioid receptor (Mu) Nociceptin Receptor (ORL1 Receptor) Nociceptin receptor (ORL-1) Nociceptin/Orphanin FQ, NOP receptor OPIATE ORL-1 OPRL1 protein ORL1 Opioid receptor like-1 Orphanin FQ receptor (ORL1) | P41146
Type:
G Protein-Coupled Receptor (GPCR)
Mol. Mass.:
40702.87
Organism:
Homo sapiens (Human)
Description:
P41146
Residue:
370
  
Inhibitor
Name:
BDBM50245974
Synonyms:
(rel)-(3-(4-fluorobenzyl)-8-(bis(2-chlorophenyl)methyl)-8-aza-bicyclo[3.2.1]octan-3-yl)methanamine | CHEMBL460093
Type:
Small organic molecule
Emp. Form.:
C28H29Cl2FN2
Mol. Mass.:
483.448
SMILES:
NCC1(Cc2ccc(F)cc2)C[C@@H]2CC[C@@H](C1)N2C(c1ccccc1Cl)c1ccccc1Cl
: