Target
Mu-type opioid receptor
Ligand
BDBM50245974
Substrate
Meas. Tech.
ChEMBL_559150 (CHEMBL1012095)
Ki
1414±n/a nM
Citation
 Yang, SWHo, GTulshian, DGreenlee, WJFernandez, XMcLeod, RLEckel, SAnthes, J Structure-activity relationships of 3-substituted N-benzhydryl-nortropane analogs as nociceptin receptor ligands for the treatment of cough. Bioorg Med Chem Lett 18:6340-3 (2008)  
Target
Name:
Mu-type opioid receptor
Synonyms:
M-OR-1 MOR-1 MUOR1 Mu opiate receptor OPRM1 hMOP | mu-type opioid receptor isoform MOR-1
Type:
G Protein-Coupled Receptor (GPCR)
Mol. Mass.:
44789.51
Organism:
Homo sapiens (Human)
Description:
P35372
Residue:
400
  
Inhibitor
Name:
BDBM50245974
Synonyms:
(rel)-(3-(4-fluorobenzyl)-8-(bis(2-chlorophenyl)methyl)-8-aza-bicyclo[3.2.1]octan-3-yl)methanamine | CHEMBL460093
Type:
Small organic molecule
Emp. Form.:
C28H29Cl2FN2
Mol. Mass.:
483.448
SMILES:
NCC1(Cc2ccc(F)cc2)C[C@@H]2CC[C@@H](C1)N2C(c1ccccc1Cl)c1ccccc1Cl
: