Target
Gonadotropin-releasing hormone receptor
Ligand
BDBM50260759
Substrate
Meas. Tech.
ChEMBL_495152 (CHEMBL1008931)
IC50
47±n/a nM
Citation
 Chen, CWu, DGuo, ZXie, QReinhart, GJMadan, AWen, JChen, THuang, CQChen, MChen, YTucci, FCRowbottom, MPontillo, JZhu, YFWade, WSaunders, JBozigian, HStruthers, RS Discovery of sodium R-(+)-4-{2-[5-(2-fluoro-3-methoxyphenyl)-3-(2-fluoro-6-[trifluoromethyl]benzyl)-4-methyl-2,6-dioxo-3,6-dihydro-2H-pyrimidin-1-yl]-1-phenylethylamino}butyrate (elagolix), a potent and orally available nonpeptide antagonist of the human gonadotropin-releasing hormone receptor. J Med Chem 51:7478-85 (2009)  
Target
Name:
Gonadotropin-releasing hormone receptor
Synonyms:
GNRHR GRHR GnRH-R Gonadotropin-releasing hormone receptor | Gonadotropin-releasing hormone receptor (GnRH)
Type:
Enzyme
Mol. Mass.:
37749.45
Organism:
Homo sapiens (Human)
Description:
P30968
Residue:
328
  
Inhibitor
Name:
BDBM50260759
Synonyms:
(R)-4-(2-(3-(2-fluoro-6-(trifluoromethyl)benzyl)-5-(2-fluoro-3-methoxyphenyl)-2,6-dioxo-2,3-dihydropyrimidin-1(6H)-yl)-1-phenylethylamino)butanoic acid CHEMBL509075
Type:
Small organic molecule
Emp. Form.:
C31H28F5N3O5
Mol. Mass.:
617.5631
SMILES:
COc1cccc(c1F)-c1cn(Cc2c(F)cccc2C(F)(F)F)c(=O)n(C[C@H](NCCCC(O)=O)c2ccccc2)c1=O
: