Target
Cytochrome P450 3A4
Ligand
BDBM50254851
Substrate
Meas. Tech.
ChEMBL_559939 (CHEMBL1013733)
IC50
400±n/a nM
Citation
 Westaway, SMBrown, SLConway, EHeightman, TDJohnson, CNLapsley, KMacdonald, GJMacPherson, DTMitchell, DJMyatt, JWSeal, JTStanway, SJStemp, GThompson, MCelestini, PColombo, AConsonni, AGagliardi, SRiccaboni, MRonzoni, SBriggs, MAMatthews, KLStevens, AJBolton, VJBoyfield, IJarvie, EMStratton, SCSanger, GJ The discovery of biaryl carboxamides as novel small molecule agonists of the motilin receptor. Bioorg Med Chem Lett 18:6429-36 (2008)  
Target
Name:
Cytochrome P450 3A4
Synonyms:
Albendazole monooxygenase CP3A4_HUMAN CYP3A4 CYPIIIA4 Cytochrome P450 3A4 (CYP3A4) Nifedipine oxidase Taurochenodeoxycholate 6-alpha-hydroxylase
Type:
Enzyme
Mol. Mass.:
57349.57
Organism:
Homo sapiens (Human)
Description:
Residue:
503
  
Inhibitor
Name:
BDBM50254851
Synonyms:
3-Cyclohexyl-1-[4'-((3R,5S)-3,5-dimethyl-piperazin-1-ylmethyl)-biphenyl-2-ylmethyl]-1-[2-(3-methoxy-phenyl)-ethyl]-urea CHEMBL501315
Type:
Small organic molecule
Emp. Form.:
C36H48N4O2
Mol. Mass.:
568.7919
SMILES:
COc1cccc(CCN(Cc2ccccc2-c2ccc(CN3C[C@H](C)N[C@H](C)C3)cc2)C(=O)NC2CCCCC2)c1
: