Target
Prostaglandin E2 receptor EP1 subtype
Ligand
BDBM50259548
Substrate
Meas. Tech.
ChEMBL_544157 (CHEMBL1013438)
Ki
2.51±n/a nM
Citation
 Hall, ABrown, SHBudd, CClayton, NMGiblin, GMGoldsmith, PHayhow, TGHurst, DNNaylor, AAnthony Rawlings, DScoccitti, TWilson, AWWinchester, WJ Discovery of GSK345931A: An EP(1) receptor antagonist with efficacy in preclinical models of inflammatory pain. Bioorg Med Chem Lett 19:497-501 (2008)  
Target
Name:
Prostaglandin E2 receptor EP1 subtype
Synonyms:
PE2R1_HUMAN PTGER1 Prostaglandin E2 receptor EP1 subtype Prostanoid EP1 receptor
Type:
Enzyme
Mol. Mass.:
41834.57
Organism:
Homo sapiens (Human)
Description:
P34995
Residue:
402
  
Inhibitor
Name:
BDBM50259548
Synonyms:
6-(5'-chloro-2'-isobutoxy-biphenyl-2-yl)-pyridine-2-carboxylate Sodium sodium 6-(5'-chloro-2'-isobutoxybiphenyl-2-yl)picolinate
Type:
Small organic molecule
Emp. Form.:
C22H19ClNO3
Mol. Mass.:
380.845
SMILES:
CC(C)COc1ccc(Cl)cc1-c1ccccc1-c1cccc(n1)C([O-])=O
: