Target
Vasopressin V2 receptor
Ligand
BDBM50246721
Substrate
Meas. Tech.
ChEMBL_560999 (CHEMBL1015239)
EC50
120±n/a nM
Citation
 Yea, CMAllan, CEAshworth, DMBarnett, JBaxter, AJBroadbridge, JDFranklin, RJHampton, SLHudson, PHorton, JAJenkins, PDPenson, AMPitt, GRRivière, PRobson, PARooker, DPSemple, GSheppard, AHaigh, RMRoe, MB New benzylureas as a novel series of potent, nonpeptidic vasopressin V2 receptor agonists. J Med Chem 51:8124-34 (2008)  
Target
Name:
Vasopressin V2 receptor
Synonyms:
ADHR AVPR2 DIR Renal-type arginine vasopressin receptor V2R_HUMAN Vasopressin V2 receptor | Vasopressin receptor
Type:
Receptor
Mol. Mass.:
40295.28
Organism:
Homo sapiens (Human)
Description:
P30518
Residue:
371
  
Inhibitor
Name:
BDBM50246721
Synonyms:
1-(4-(10,11-Dihydro-5H-pyrrolo[2,1-c][1,4]benzodiazepin-10-ylcarbonyl)-2-methylbenzylcarbamoyl)-L-proline-N,N-dimethylamide | CHEMBL475333
Type:
Small organic molecule
Emp. Form.:
C29H33N5O3
Mol. Mass.:
499.604
SMILES:
CN(C)C(=O)[C@@H]1CCCN1C(=O)NCc1ccc(cc1C)C(=O)N1Cc2cccn2Cc2ccccc12
: