Target
Mu-type opioid receptor
Ligand
BDBM50189920
Substrate
Meas. Tech.
ChEMBL_540202 (CHEMBL1029831)
Ki
0.46±n/a nM
Citation
 Ballet, SFeytens, DWachter, RDVlaeminck, MDMarczak, EDSalvadori, SGraaf, CRognan, DNegri, LLattanzi, RLazarus, LHTourwé, DBalboni, G Conformationally constrained opioid ligands: the Dmt-Aba and Dmt-Aia versus Dmt-Tic scaffold. Bioorg Med Chem Lett 19:433-7 (2008)  
Target
Name:
Mu-type opioid receptor
Synonyms:
MOR-1 Mu-type opioid receptor (MOR) OPRM_RAT Opioid receptor B Ror-b
Type:
G Protein-Coupled Receptor (GPCR)
Mol. Mass.:
44503.11
Organism:
Rattus norvegicus (rat)
Description:
Competition binding assays were carried out using membrane preparations from transfected HN9.10 cells that constitutively expressed the mu opioid receptor.
Residue:
398
  
Inhibitor
Name:
BDBM50189920
Synonyms:
(S)-2-amino-N-((S)-2-(2-(benzylamino)-2-oxoethyl)-3-oxo-2,3,4,5-tetrahydro-1H-benzo[c]azepin-4-yl)-3-(4-hydroxy-2,6-dimethylphenyl)propanamide H-Dmt-Aba-Gly-NH-CH2-Ph
Type:
Small organic molecule
Emp. Form.:
C30H34N4O4
Mol. Mass.:
514.6154
SMILES:
Cc1cc(O)cc(C)c1C[C@H](N)C(=O)N[C@H]1Cc2ccccc2CN(CC(=O)NCc2ccccc2)C1=O
: