Target
Adenosine receptor A2b
Ligand
BDBM50254350
Substrate
Meas. Tech.
ChEMBL_560534 (CHEMBL1021384)
Ki
937±n/a nM
Citation
 Gillespie, RJBamford, SJBotting, RComer, MDenny, SGaur, SGriffin, MJordan, AMKnight, ARLerpiniere, JLeonardi, SLightowler, SMcAteer, SMerrett, AMisra, APadfield, AReece, MSaadi, MSelwood, DLStratton, GCSurry, DTodd, RTong, XRuston, VUpton, RWeiss, SM Antagonists of the human A(2A) adenosine receptor. 4. Design, synthesis, and preclinical evaluation of 7-aryltriazolo[4,5-d]pyrimidines. J Med Chem 52:33-47 (2009)  
Target
Name:
Adenosine receptor A2b
Synonyms:
AA2BR_HUMAN ADORA2B Adenosine receptors A2b | Adenosine receptors; A2a & A2b
Type:
G Protein-Coupled Receptor (GPCR)
Mol. Mass.:
36341.22
Organism:
Homo sapiens (Human)
Description:
Residue:
332
  
Inhibitor
Name:
BDBM50254350
Synonyms:
3-(5-Amino-7-(2-furyl)-3H-[1,2,3]triazolo[4,5-d]pyrimidin-3-ylmethyl)-N-isopropyl-N-methylbenzamide | CHEMBL460805
Type:
Small organic molecule
Emp. Form.:
C20H21N7O2
Mol. Mass.:
391.4264
SMILES:
CC(C)N(C)C(=O)c1cccc(Cn2nnc3c(nc(N)nc23)-c2ccco2)c1
: