Target
C-C chemokine receptor type 4
Ligand
BDBM50265668
Substrate
Meas. Tech.
ChEMBL_558791 (CHEMBL1020785)
IC50
100±n/a nM
Citation
 Yokoyama, KIshikawa, NIgarashi, SKawano, NMasuda, NHamaguchi, WYamasaki, SKoganemaru, YHattori, KMiyazaki, TOgino, SMatsumoto, YTakeuchi, MOhta, M Potent and orally bioavailable CCR4 antagonists: Synthesis and structure-activity relationship study of 2-aminoquinazolines. Bioorg Med Chem 17:64-73 (2008)  
Target
Name:
C-C chemokine receptor type 4
Synonyms:
C-C CKR-4 C-C chemokine receptor type 4 (CCR4) CCR-4 CCR4_HUMAN CMKBR4 | K5-5
Type:
Enzyme
Mol. Mass.:
41406.41
Organism:
Homo sapiens (Human)
Description:
P51679
Residue:
360
  
Inhibitor
Name:
BDBM50265668
Synonyms:
CHEMBL496152 | N-(4-chlorophenyl)-6,7-dimethoxy-2-(3-methoxy-1,4'-bipiperidin-1'-yl)quinazolin-4-amine
Type:
Small organic molecule
Emp. Form.:
C27H34ClN5O3
Mol. Mass.:
512.044
SMILES:
COC1CCCN(C1)C1CCN(CC1)c1nc(Nc2ccc(Cl)cc2)c2cc(OC)c(OC)cc2n1
: