Target
C-C chemokine receptor type 4
Ligand
BDBM50244380
Substrate
Meas. Tech.
ChEMBL_558792 (CHEMBL1020786)
IC50
130±n/a nM
Citation
 Yokoyama, KIshikawa, NIgarashi, SKawano, NMasuda, NHamaguchi, WYamasaki, SKoganemaru, YHattori, KMiyazaki, TOgino, SMatsumoto, YTakeuchi, MOhta, M Potent and orally bioavailable CCR4 antagonists: Synthesis and structure-activity relationship study of 2-aminoquinazolines. Bioorg Med Chem 17:64-73 (2008)  
Target
Name:
C-C chemokine receptor type 4
Synonyms:
C-C CKR-4 CCR-4 CD_antigen=CD194 Cmkbr4
Type:
PROTEIN
Mol. Mass.:
41410.76
Organism:
Mus musculus
Description:
ChEMBL_512157
Residue:
360
  
Inhibitor
Name:
BDBM50244380
Synonyms:
CHEMBL487635 N-cycloheptyl-6,7-dimethoxy-2-(4-(pyrrolidin-1-yl)piperidin-1-yl)quinazolin-4-amine | N-cycloheptyl-6,7-dimethoxy-2-(4-pyrrolidin-1-ylpiperidin-1-yl)quinazolin-4-amine
Type:
Small organic molecule
Emp. Form.:
C26H39N5O2
Mol. Mass.:
453.6202
SMILES:
COc1cc2nc(nc(NC3CCCCCC3)c2cc1OC)N1CCC(CC1)N1CCCC1
: