Target
Macrophage migration inhibitory factor
Ligand
BDBM50186434
Substrate
Meas. Tech.
ChEMBL_558850 (CHEMBL1021636)
IC50
7000±n/a nM
Citation
 Cournia, ZLeng, LGandavadi, SDu, XBucala, RJorgensen, WL Discovery of human macrophage migration inhibitory factor (MIF)-CD74 antagonists via virtual screening. J Med Chem 52:416-24 (2009)  
Target
Name:
Macrophage migration inhibitory factor
Synonyms:
GIF Glycosylation-inhibiting factor L-dopachrome tautomerase MIF/CD74 (Macrophage migration inhibitory factor and HLA-DR antigens-associated invariant chain) MMIF Macrophage migration inhibitory factor (MIF) | Phenylpyruvate tautomerase
Type:
Enzyme
Mol. Mass.:
12478.18
Organism:
Homo sapiens (Human)
Description:
P14174
Residue:
115
  
Inhibitor
Name:
BDBM50186434
Synonyms:
(R)-methyl 2-(3-(4-hydroxyphenyl)-4,5-dihydroisoxazol-5-yl)acetate CHEMBL211769
Type:
Small organic molecule
Emp. Form.:
C12H13NO4
Mol. Mass.:
235.2359
SMILES:
COC(=O)C[C@H]1CC(=NO1)c1ccc(O)cc1
: