Target
Neuronal acetylcholine receptor subunit alpha-4
Ligand
BDBM82070
Substrate
Meas. Tech.
ChEMBL_518972 (CHEMBL941560)
Ki
4±n/a nM
Citation
 Pallavicini, MBolchi, CBinda, MCilia, AClementi, FFerrara, RFumagalli, LGotti, CMoretti, MPedretti, AVistoli, GValoti, E 5-(2-Pyrrolidinyl)oxazolidinones and 2-(2-pyrrolidinyl)benzodioxanes: synthesis of all the stereoisomers and alpha4beta2 nicotinic affinity. Bioorg Med Chem Lett 19:854-9 (2009)  
Target
Name:
Neuronal acetylcholine receptor subunit alpha-4
Synonyms:
ACHA4_RAT Cholinergic, Nicotinic Alpha4Beta2 Chrna4 Neuronal acetylcholine receptor (alpha4beta2 nAChR) Neuronal acetylcholine receptor subunit alpha 4 beta 2 | Neuronal acetylcholine receptor subunit alpha-4
Type:
Enzyme
Mol. Mass.:
70196.44
Organism:
Rattus norvegicus (Rat)
Description:
P09483
Residue:
630
  
Inhibitor
Name:
BDBM82070
Synonyms:
CAS_29790-52-1 Nicotine-D salicylate US9303017, Nicotine
Type:
Emp. Form.:
C10H14N2
Mol. Mass.:
162.2316
SMILES:
CN1CCC[C@H]1c1cccnc1
: