Target
Gastrin/cholecystokinin type B receptor
Ligand
BDBM50265533
Substrate
Meas. Tech.
ChEMBL_559853 (CHEMBL1021534)
Ki
40.7±n/a nM
Citation
 Zheng, YAkgün, EHarikumar, KGHopson, JPowers, MDLunzer, MMMiller, LJPortoghese, PS Induced association of mu opioid (MOP) and type 2 cholecystokinin (CCK2) receptors by novel bivalent ligands. J Med Chem 52:247-58 (2009)  
Target
Name:
Gastrin/cholecystokinin type B receptor
Synonyms:
CCK-2 receptor CCK-BR CCKRB Cholecystokinin receptor GASR_HUMAN | Gastrin/cholecystokinin type B receptor
Type:
G Protein-Coupled Receptor (GPCR)
Mol. Mass.:
48445.79
Organism:
Homo sapiens (Human)
Description:
Stable expression of human CCK-2 receptors in HEK 293 cells.
Residue:
447
  
Inhibitor
Name:
BDBM50265533
Synonyms:
2-({[(1S,5R,13R,14S,17S)-9,17-dihydroxy-4-methyl-12-oxa-4-azapentacyclo[9.6.1.0^{1,13}.0^{5,17}.0^{7,18}]octadeca-7(18),8,10-trien-14-yl]carbamoyl}methoxy)-N-(4-{2-[(methylcarbamoyl)methoxy]acetamido}butyl)acetamide | CHEMBL452991
Type:
Small organic molecule
Emp. Form.:
C30H43N5O9
Mol. Mass.:
617.6905
SMILES:
CNC(=O)COCC(=O)NCCCCNC(=O)COCC(=O)N[C@H]1CC[C@@]2(O)[C@H]3Cc4cc(O)cc5O[C@@H]1[C@]2(CCN3C)c45
: