Target
Prostaglandin G/H synthase 1
Ligand
BDBM50056999
Substrate
Meas. Tech.
ChEMBL_516240 (CHEMBL985097)
IC50
10900±n/a nM
Citation
 Tributino, JLDuarte, CDCorrêa, RSDoriguetto, ACEllena, JRomeiro, NCCastro, NGMiranda, ALBarreiro, EJFraga, CA Novel 6-methanesulfonamide-3,4-methylenedioxyphenyl-N-acylhydrazones: orally effective anti-inflammatory drug candidates. Bioorg Med Chem 17:1125-31 (2009)  
Target
Name:
Prostaglandin G/H synthase 1
Synonyms:
COX-1 Cyclooxygenase Cyclooxygenase-1 (COX-1) PTGS1 | Prostaglandin G/H synthase (cyclooxygenase)
Type:
Enzyme
Mol. Mass.:
68692.62
Organism:
Homo sapiens (Human)
Description:
P23219
Residue:
599
  
Inhibitor
Name:
BDBM50056999
Synonyms:
CHEMBL56367 | nimesulide
Type:
Small organic molecule
Emp. Form.:
C13H12N2O5S
Mol. Mass.:
308.31
SMILES:
CS(=O)(=O)Nc1ccc(cc1Oc1ccccc1)[N+]([O-])=O
: