Target
C-X-C chemokine receptor type 1
Ligand
BDBM50248547
Substrate
Meas. Tech.
ChEMBL_566227 (CHEMBL963308)
Ki
21±n/a nM
Citation
 Biju, PTaveras, AGYu, YZheng, JHipkin, RWFossetta, JFan, XFine, JLundell, D 3,4-Diamino-1,2,5-thiadiazole as potent and selective CXCR2 antagonists. Bioorg Med Chem Lett 19:1434-7 (2009)  
Target
Name:
C-X-C chemokine receptor type 1
Synonyms:
C-X-C chemokine receptor type 1 (CXCR-1) CMKAR1 CXCR1_HUMAN Interleukin-8 receptor A | Interleukin-8 receptors, CXCR1/CXCR2
Type:
Enzyme
Mol. Mass.:
39803.83
Organism:
Homo sapiens (Human)
Description:
P25024
Residue:
350
  
Inhibitor
Name:
BDBM50248547
Synonyms:
(R)-2-hydroxy-N,N-dimethyl-3-(4-(1-phenylpropylamino)-1,2,5-thiadiazol-3-ylamino)benzamide | CHEMBL464509
Type:
Small organic molecule
Emp. Form.:
C20H23N5O2S
Mol. Mass.:
397.494
SMILES:
CC[C@@H](Nc1nsnc1Nc1cccc(C(=O)N(C)C)c1O)c1ccccc1
: