Target
C-X-C chemokine receptor type 1
Ligand
BDBM50248589
Substrate
Meas. Tech.
ChEMBL_566227 (CHEMBL963308)
Ki
36±n/a nM
Citation
 Biju, PTaveras, AGYu, YZheng, JHipkin, RWFossetta, JFan, XFine, JLundell, D 3,4-Diamino-1,2,5-thiadiazole as potent and selective CXCR2 antagonists. Bioorg Med Chem Lett 19:1434-7 (2009)  
Target
Name:
C-X-C chemokine receptor type 1
Synonyms:
C-X-C chemokine receptor type 1 (CXCR-1) CMKAR1 CXCR1_HUMAN Interleukin-8 receptor A | Interleukin-8 receptors, CXCR1/CXCR2
Type:
Enzyme
Mol. Mass.:
39803.83
Organism:
Homo sapiens (Human)
Description:
P25024
Residue:
350
  
Inhibitor
Name:
BDBM50248589
Synonyms:
2-hydroxy-N,N-dimethyl-3-(4-(2,2,2-trifluoro-1-phenylethylamino)-1,2,5-thiadiazol-3-ylamino)benzamide | CHEMBL517430
Type:
Small organic molecule
Emp. Form.:
C19H18F3N5O2S
Mol. Mass.:
437.439
SMILES:
CN(C)C(=O)c1cccc(Nc2nsnc2NC(c2ccccc2)C(F)(F)F)c1O
: