Target
5-hydroxytryptamine receptor 3A
Ligand
BDBM50293279
Substrate
Meas. Tech.
ChEMBL_564575 (CHEMBL964015)
IC50
385±n/a nM
Citation
 Lemaître, SLepailleur, ABureau, RButt-Gueulle, SLelong-Boulouard, VDuchatelle, PBoulouard, MDumuis, ADaveu, CLezoualc'h, FPfeiffer, BDauphin, FRault, S Novel antagonists of serotonin-4 receptors: synthesis and biological evaluation of pyrrolothienopyrazines. Bioorg Med Chem 17:2607-22 (2009)  
Target
Name:
5-hydroxytryptamine receptor 3A
Synonyms:
5-HT-3 5-HT3A 5-hydroxytryptamine receptor 3 (5-HT3) 5-hydroxytryptamine receptor 3A (5HT3A) 5HT3R HTR3A Serotonin 3 receptor (5HT3) Serotonin-gated ion channel receptor | Serotonin-gated ion channel receptor 3
Type:
Protein
Mol. Mass.:
55283.27
Organism:
Homo sapiens (Human)
Description:
P46098
Residue:
478
  
Inhibitor
Name:
BDBM50293279
Synonyms:
1-Methyl-5-[(1-propylpiperidin-4-yl)methyloxy]-pyrrolo[1,2-a]thieno[2,3-e]pyrazine | CHEMBL470432
Type:
Small organic molecule
Emp. Form.:
C19H25N3OS
Mol. Mass.:
343.486
SMILES:
CCCN1CCC(COc2nc3scc(C)c3n3cccc23)CC1
: