Target
5-hydroxytryptamine receptor 4
Ligand
BDBM50413521
Substrate
Meas. Tech.
ChEMBL_564555 (CHEMBL963182)
Ki
20.89±n/a nM
Citation
 Lemaître, SLepailleur, ABureau, RButt-Gueulle, SLelong-Boulouard, VDuchatelle, PBoulouard, MDumuis, ADaveu, CLezoualc'h, FPfeiffer, BDauphin, FRault, S Novel antagonists of serotonin-4 receptors: synthesis and biological evaluation of pyrrolothienopyrazines. Bioorg Med Chem 17:2607-22 (2009)  
Target
Name:
5-hydroxytryptamine receptor 4
Synonyms:
5-HT4 5HT4R_CAVPO Serotonin 4 (5-HT4) receptor
Type:
Enzyme Catalytic Domain
Mol. Mass.:
43735.29
Organism:
GUINEA PIG
Description:
5-HT4 HTR4 GUINEA PIG::O70528
Residue:
388
  
Inhibitor
Name:
BDBM50413521
Synonyms:
CHEMBL471663
Type:
Small organic molecule
Emp. Form.:
C19H25N3OS
Mol. Mass.:
343.486
SMILES:
CCCCN1CCC(COc2nc3ccsc3n3cccc23)CC1
: