Target
Oxysterols receptor LXR-beta
Ligand
BDBM50258121
Substrate
Meas. Tech.
ChEMBL_566456 (CHEMBL958323)
EC50
2700±n/a nM
Citation
 Swahn, BMMacsari, IViklund, JOhberg, LSjödin, JNeelissen, JLindquist, J Liver X receptor agonists with selectivity for LXRbeta; N-aryl-3,3,3-trifluoro-2-hydroxy-2-methylpropionamides. Bioorg Med Chem Lett 19:2009-12 (2009)  
Target
Name:
Oxysterols receptor LXR-beta
Synonyms:
LXRB Liver X, LXR beta NR1H2 Nuclear receptor NER Ubiquitously-expressed nuclear receptor
Type:
Enzyme Catalytic Domain
Mol. Mass.:
50978.79
Organism:
Homo sapiens (Human)
Description:
P55055
Residue:
460
  
Inhibitor
Name:
BDBM50258121
Synonyms:
CHEMBL495196 | N-(2-chloro-4-(4-cyano-N-methylphenylsulfonamido)phenyl)-3,3,3-trifluoro-2-hydroxy-2-methylpropanamide
Type:
Small organic molecule
Emp. Form.:
C18H15ClF3N3O4S
Mol. Mass.:
461.843
SMILES:
CN(c1ccc(NC(=O)C(C)(O)C(F)(F)F)c(Cl)c1)S(=O)(=O)c1ccc(cc1)C#N
: