Target
Oxysterols receptor LXR-alpha
Ligand
BDBM20164
Substrate
Meas. Tech.
ChEMBL_566455 (CHEMBL958322)
EC50
280±n/a nM
Citation
 Swahn, BMMacsari, IViklund, JOhberg, LSjödin, JNeelissen, JLindquist, J Liver X receptor agonists with selectivity for LXRbeta; N-aryl-3,3,3-trifluoro-2-hydroxy-2-methylpropionamides. Bioorg Med Chem Lett 19:2009-12 (2009)  
Target
Name:
Oxysterols receptor LXR-alpha
Synonyms:
LXRA Liver X receptor alpha Liver X receptor alpha (NR1H3) NR1H3 Nuclear orphan receptor LXR-alpha | Nuclear receptor subfamily 1 group H member 3
Type:
Enzyme Catalytic Domain
Mol. Mass.:
50403.85
Organism:
Homo sapiens (Human)
Description:
Q13133
Residue:
447
  
Inhibitor
Name:
BDBM20164
Synonyms:
(1S,2R,5S,10S,11S,14R,15R)-14-[(2R)-4-[(2S)-3,3-dimethyloxiran-2-yl]butan-2-yl]-2,15-dimethyltetracyclo[8.7.0.0^{2,7}.0^{11,15}]heptadec-7-en-5-ol CHEMBL434302 | Epoxycholesterol
Type:
Steroid
Emp. Form.:
C27H44O2
Mol. Mass.:
400.6371
SMILES:
[H][C@@]1(CC[C@@H](C)[C@@]2([H])CC[C@@]3([H])[C@]4([H])CC=C5C[C@@]([H])(O)CC[C@]5(C)[C@@]4([H])CC[C@]23C)OC1(C)C
: