Target
5-hydroxytryptamine receptor 2B
Ligand
BDBM50249425
Substrate
Meas. Tech.
ChEMBL_499777 (CHEMBL968750)
IC50
48±n/a nM
Citation
 Moss, NChoi, YCogan, DFlegg, AKahrs, ALoke, PMeyn, ONagaraja, RNapier, SParker, AThomas Peterson, JRamsden, PSarko, CSkow, DTomlinson, JTye, HWhitaker, M A new class of 5-HT2B antagonists possesses favorable potency, selectivity, and rat pharmacokinetic properties. Bioorg Med Chem Lett 19:2206-10 (2009)  
Target
Name:
5-hydroxytryptamine receptor 2B
Synonyms:
5-HT-2B 5-hydroxytryptamine (serotonin) receptor 2B [Homo sapiens] 5-hydroxytryptamine receptor 2C (5HT2C) HTR2B Serotonin 2b (5-HT2b) receptor | Serotonin Receptor 2B
Type:
G Protein-Coupled Receptor (GPCR)
Mol. Mass.:
54312.47
Organism:
Homo sapiens (Human)
Description:
Receptor binding assays were performed using human clone stably expressed in CHO cells.
Residue:
481
  
Inhibitor
Name:
BDBM50249425
Synonyms:
(4-(1H-benzo[d]imidazol-2-yl)piperidin-1-yl)(4-(piperidin-1-yl)phenyl)methanone | CHEMBL474839
Type:
Small organic molecule
Emp. Form.:
C24H28N4O
Mol. Mass.:
388.5053
SMILES:
O=C(N1CCC(CC1)c1nc2ccccc2[nH]1)c1ccc(cc1)N1CCCCC1
: