Target
Glycogen synthase kinase-3 beta
Ligand
BDBM50267716
Substrate
Meas. Tech.
ChEMBL_563639 (CHEMBL963374)
IC50
710±n/a nM
Citation
 Gaisina, INGallier, FOugolkov, AVKim, KHKurome, TGuo, SHolzle, DLuchini, DNBlond, SYBilladeau, DDKozikowski, AP From a natural product lead to the identification of potent and selective benzofuran-3-yl-(indol-3-yl)maleimides as glycogen synthase kinase 3beta inhibitors that suppress proliferation and survival of pancreatic cancer cells. J Med Chem 52:1853-63 (2009)  
Target
Name:
Glycogen synthase kinase-3 beta
Synonyms:
GSK-3 beta GSK3B Glycogen synthase kinase 3 beta (GSK3B) Glycogen synthase kinase-3 beta (GSK-3B) Glycogen synthase kinase-3 beta (GSK3B) Glycogen synthase kinase-3beta (GSK3B) | Serine/threonine-protein kinase GSK3B
Type:
Enzyme
Mol. Mass.:
46756.38
Organism:
Homo sapiens (Human)
Description:
P49841
Residue:
420
  
Inhibitor
Name:
BDBM50267716
Synonyms:
3-(5-Fluorobenzofuran-3-yl)-4-(5-methyl-5H-[1,3]dioxolo[4,5-f]indol-7-yl)pyrrole-2,5-dione | CHEMBL483465
Type:
Small organic molecule
Emp. Form.:
C22H13FN2O5
Mol. Mass.:
404.3474
SMILES:
Cn1cc(C2=C(C(=O)NC2=O)c2coc3ccc(F)cc23)c2cc3OCOc3cc12
: