Target
Peroxisome proliferator-activated receptor gamma
Ligand
BDBM50277897
Substrate
Meas. Tech.
ChEMBL_502070 (CHEMBL983195)
IC50
19±n/a nM
Citation
 Bénardeau, ABenz, JBinggeli, ABlum, DBoehringer, MGrether, UHilpert, HKuhn, BMärki, HPMeyer, MPüntener, KRaab, SRuf, ASchlatter, DMohr, P Aleglitazar, a new, potent, and balanced dual PPARalpha/gamma agonist for the treatment of type II diabetes. Bioorg Med Chem Lett 19:2468-73 (2009)  
Target
Name:
Peroxisome proliferator-activated receptor gamma
Synonyms:
NR1C3 PPAR-gamma PPARG_HUMAN Peroxisome proliferator-activated receptor gamma (PPAR gamma) Peroxisome proliferator-activated receptor gamma (PPARĪ³) peroxisome proliferator-activated receptor gamma isoform 2
Type:
Nuclear Receptor
Mol. Mass.:
57613.46
Organism:
Homo sapiens (Human)
Description:
P37231
Residue:
505
  
Inhibitor
Name:
BDBM50277897
Synonyms:
(2S)-2-methoxy-3-{4-[2-(5-methyl-2-phenyl-1,3-oxazol-4-yl)ethoxy]-1-benzothiophen-7-yl}propanoic acid CHEMBL519504
Type:
Small organic molecule
Emp. Form.:
C24H23NO5S
Mol. Mass.:
437.508
SMILES:
CO[C@@H](Cc1ccc(OCCc2nc(oc2C)-c2ccccc2)c2ccsc12)C(O)=O
: