Target
Alpha-1B adrenergic receptor
Ligand
BDBM50259534
Substrate
Meas. Tech.
ChEMBL_499391 (CHEMBL1015843)
EC50
1770±n/a nM
Citation
 Whitlock, GABrennan, PERoberts, LRStobie, A Potent and selective alpha1A adrenoceptor partial agonists--novel imidazole frameworks. Bioorg Med Chem Lett 19:3118-21 (2009)  
Target
Name:
Alpha-1B adrenergic receptor
Synonyms:
ADA1B_HUMAN Adrenergic alpha1B Adrenergic receptor alpha Alpha 1B-adrenoreceptor | Alpha-1B adrenergic receptor
Type:
Enzyme
Mol. Mass.:
56862.13
Organism:
Homo sapiens (Human)
Description:
P35368
Residue:
520
  
Inhibitor
Name:
BDBM50259534
Synonyms:
6-(2-fluorophenyl)-6,7-dihydro-5H-pyrrolo[1,2-a]imidazole | CHEMBL511411
Type:
Small organic molecule
Emp. Form.:
C12H11FN2
Mol. Mass.:
202.2275
SMILES:
Fc1ccccc1C1Cc2nccn2C1
: