Target
Sodium channel protein type 2 subunit alpha
Ligand
BDBM50259540
Substrate
Meas. Tech.
ChEMBL_499575 (CHEMBL1025443)
IC50
>100000±n/a nM
Citation
 Fantini, MRivara, MZuliani, VKalmar, CLVacondio, FSilva, CBaheti, ARSingh, NMerrick, ECKatari, RSCocconcelli, GGhiron, CPatel, MK 2,4(5)-diarylimidazoles as inhibitors of hNaV1.2 sodium channels: pharmacological evaluation and structure-property relationships. Bioorg Med Chem 17:3642-8 (2009)  
Target
Name:
Sodium channel protein type 2 subunit alpha
Synonyms:
HBSC II SCN2A SCN2A2 Sodium (Site 2) Sodium channel protein type 2 alpha subunit Voltage-gated sodium channel subunit alpha Nav1.2
Type:
Enzyme
Mol. Mass.:
227954.68
Organism:
Homo sapiens (Human)
Description:
Q99250
Residue:
2005
  
Inhibitor
Name:
BDBM50259540
Synonyms:
2-(4-Chlorophenyl)-4(5)-(3-trifluoromethylphenyl)-imidazole | CHEMBL467919
Type:
Small organic molecule
Emp. Form.:
C16H10ClF3N2
Mol. Mass.:
322.712
SMILES:
FC(F)(F)c1cccc(c1)-c1c[nH]c(n1)-c1ccc(Cl)cc1
: