Target
Melanin-concentrating hormone receptor 1
Ligand
BDBM50258450
Substrate
Meas. Tech.
ChEMBL_500270 (CHEMBL969605)
IC50
1.3±n/a nM
Citation
 Suzuki, TMoriya, MSakamoto, TSuga, TKishino, HTakahashi, HIshikawa, MNagai, KImai, YSekino, EIto, MIwaasa, HIshihara, ATokita, SKanatani, ASato, NFukami, T Discovery of novel spiro-piperidine derivatives as highly potent and selective melanin-concentrating hormone 1 receptor antagonists. Bioorg Med Chem Lett 19:3072-7 (2009)  
Target
Name:
Melanin-concentrating hormone receptor 1
Synonyms:
G-protein coupled receptor 24 MCH receptor 1 MCH-R1 MCHR-1 MCHR1_HUMAN Melanin-Concentrating Hormone Receptor 1 (MCH1R) Melanin-concentrating hormone receptor 1 (MCH-1) Melanin-concentrating hormone receptor 1 (MCHR-1) SLC-1 Somatostatin receptor-like protein
Type:
G Protein-Coupled Receptor (GPCR)
Mol. Mass.:
45976.27
Organism:
Homo sapiens (Human)
Description:
Membranes from CHO-K1 cells stably expressing human MCH1R were used in assays.
Residue:
422
  
Inhibitor
Name:
BDBM50258450
Synonyms:
(+/-)-2-(3,4-difluorophenyl)-N-(3-(6-fluoro-1H-spiro[furo[3,4-c]pyridine-3,4'-piperidine]-1'-yl)propyl)-N-methyl-2-(1H-pyrazol-1-yl)acetamide CHEMBL466425
Type:
Small organic molecule
Emp. Form.:
C26H28F3N5O2
Mol. Mass.:
499.528
SMILES:
CN(CCCN1CCC2(CC1)OCc1cc(F)ncc21)C(=O)C(c1ccc(F)c(F)c1)n1cccn1
: