Target
Bile acid receptor
Ligand
BDBM21724
Substrate
Meas. Tech.
ChEMBL_500797 (CHEMBL974378)
EC50
59±n/a nM
Citation
 Bass, JYCaldwell, RDCaravella, JAChen, LCreech, KLDeaton, DNMadauss, KPMarr, HBMcFadyen, RBMiller, ABParks, DJTodd, DWilliams, SPWisely, GB Substituted isoxazole analogs of farnesoid X receptor (FXR) agonist GW4064. Bioorg Med Chem Lett 19:2969-73 (2009)  
Target
Name:
Bile acid receptor
Synonyms:
BAR FXR HRR1 NR1H4_HUMAN RIP14 Retinoid X receptor-interacting protein 14 | farnesoid x receptor
Type:
Nuclear Receptor
Mol. Mass.:
55916.24
Organism:
Homo sapiens (Human)
Description:
Q96RI1
Residue:
486
  
Inhibitor
Name:
BDBM21724
Synonyms:
3-[(E)-2-(2-chloro-4-{[3-(2,6-dichlorophenyl)-5-(1-methylethyl)isoxazol-4-yl]methoxy}phenyl)ethenyl]benzoic acid CHEMBL318457 | GW-4064
Type:
Small organic molecule
Emp. Form.:
C28H22Cl3NO4
Mol. Mass.:
542.838
SMILES:
CC(C)c1onc(c1COc1ccc(\C=C\c2cccc(c2)C(O)=O)c(Cl)c1)-c1c(Cl)cccc1Cl
: