Target
Histone-arginine methyltransferase CARM1
Ligand
BDBM50258860
Substrate
Meas. Tech.
ChEMBL_500555 (CHEMBL971420)
IC50
2100±n/a nM
Citation
 Huynh, TChen, ZPang, SGeng, JBandiera, TBindi, SVianello, PRoletto, FThieffine, SGalvani, AVaccaro, WPoss, MATrainor, GLLorenzi, MVGottardis, MJayaraman, LPurandare, AV Optimization of pyrazole inhibitors of Coactivator Associated Arginine Methyltransferase 1 (CARM1). Bioorg Med Chem Lett 19:2924-7 (2009)  
Target
Name:
Histone-arginine methyltransferase CARM1
Synonyms:
CARM1 Coactivator-associated arginine methyltransferase 1 PRMT4 Protein arginine methyltransferase 4 (PRMT4)
Type:
Protein
Mol. Mass.:
65855.47
Organism:
Homo sapiens (Human)
Description:
Q86X55
Residue:
608
  
Inhibitor
Name:
BDBM50258860
Synonyms:
(S)-2-amino-N-(3-(5-(5-phenyl-1,3,4-oxadiazol-2-yl)-1H-imidazol-1-yl)benzyl)propanamide | CHEMBL467062
Type:
Small organic molecule
Emp. Form.:
C21H20N6O2
Mol. Mass.:
388.4225
SMILES:
C[C@H](N)C(=O)NCc1cccc(c1)-n1cncc1-c1nnc(o1)-c1ccccc1
: