Target
Smoothened homolog
Ligand
BDBM50268375
Substrate
Meas. Tech.
ChEMBL_522935 (CHEMBL995457)
IC50
4493±n/a nM
Citation
 Miller-Moslin, KPeukert, SJain, RKMcEwan, MAKarki, RLlamas, LYusuff, NHe, FLi, YSun, YDai, MPerez, LMichael, WSheng, TLei, HZhang, RWilliams, JBourret, ARamamurthy, AYuan, JGuo, RMatsumoto, MVattay, AManiara, WAmaral, ADorsch, MKelleher, JF 1-amino-4-benzylphthalazines as orally bioavailable smoothened antagonists with antitumor activity. J Med Chem 52:3954-68 (2009)  
Target
Name:
Smoothened homolog
Synonyms:
SMO_MOUSE Smoh
Type:
PROTEIN
Mol. Mass.:
87472.73
Organism:
Mus musculus
Description:
ChEMBL_1510377
Residue:
793
  
Inhibitor
Name:
BDBM50268375
Synonyms:
1-Pyridin-4-ylmethyl-4-(4-pyridin-2-ylpiperazin-1-yl)phthalazine | CHEMBL497003
Type:
Small organic molecule
Emp. Form.:
C23H22N6
Mol. Mass.:
382.461
SMILES:
C(c1ccncc1)c1nnc(N2CCN(CC2)c2ccccn2)c2ccccc12
: