Target
5-hydroxytryptamine receptor 1A
Ligand
BDBM50280934
Substrate
Meas. Tech.
ChEMBL_1455 (CHEMBL616578)
Ki
38±n/a nM
Citation
 Langlois, MGaudy, FShen, SBrémont, B Synthesis of new derivatives of 8-OH-DPAT: Influence of substitution on the aromatic ring on the pharmacological profile Bioorg Med Chem Lett 3:2035-2038 (1993)    Article 
Target
Name:
5-hydroxytryptamine receptor 1A
Synonyms:
5-HT-1A 5-HT1A 5-hydroxytryptamine receptor 1A (5HT1A) 5ht1a Htr1a Serotonin 1a (5-HT1a) receptor/Adrenergic receptor alpha-1 | Serotonin receptor 1A
Type:
G Protein-Coupled Receptor (GPCR)
Mol. Mass.:
46445.29
Organism:
Rattus norvegicus (rat)
Description:
Binding assays were performed using rat hippocampal membranes.
Residue:
422
  
Inhibitor
Name:
BDBM50280934
Synonyms:
1-tert-Butylamino-3-(thiochroman-8-yloxy)-propan-2-ol CHEMBL434200 Tertatolol
Type:
Small organic molecule
Emp. Form.:
C16H25NO2S
Mol. Mass.:
295.44
SMILES:
CC(C)(C)NCC(O)COc1cccc2CCCSc12
: