Target
Polyunsaturated fatty acid 5-lipoxygenase
Ligand
BDBM50000541
Substrate
Meas. Tech.
ChEBML_3839
IC50
3300±n/a nM
Citation
 Hodgson, STWates, PJBlackwell, GJCraig, CYeadon, MBoughton-Smith, N Design and synthesis of achiral 5-lipoxygenase inhibitors employing the cyclobutyl group Bioorg Med Chem Lett 3:2565-2570 (1993)    Article 
Target
Name:
Polyunsaturated fatty acid 5-lipoxygenase
Synonyms:
5-LO 5-Lipoxygenase (5-LO) 5-Lipoygenase ALOX5 LOG5 | LOX5_HUMAN
Type:
Enzyme
Mol. Mass.:
77972.74
Organism:
Homo sapiens (Human)
Description:
Recombinant protein was purified from E. coli lysate. After ammonium sulfate precipitation and subsequent steps, the supernatant (S100) was used for 5-LO activity assay.
Residue:
674
  
Inhibitor
Name:
BDBM50000541
Synonyms:
(+-)-1-(1-Benzo[b]thien-2-ylethyl)-1-hydroxyurea CHEMBL93 N-(1-Benzo(b)thien-2-ylethyl)-N-hydroxyurea ZILEUTON | Zyflo (TN)
Type:
Small organic molecule
Emp. Form.:
C11H12N2O2S
Mol. Mass.:
236.29
SMILES:
CC(N(O)C(N)=O)c1cc2ccccc2s1
: