Target
Type-1 angiotensin II receptor
Ligand
BDBM50281942
Substrate
Meas. Tech.
ChEMBL_36927 (CHEMBL652722)
IC50
12±n/a nM
Citation
 Allen, EEde Laszlo, SEHuang, SXQuagliato, CSGreenlee, WJChang, RSChen, TBFaust, KALotti, VJ Quinazolinones 1: design and synthesis of potent quinazolinone- containing AT1-selective angiotensin-II receptor antagonists Bioorg Med Chem Lett 3:1293-1298 (1993)    Article 
Target
Name:
Type-1 angiotensin II receptor
Synonyms:
AGTR1 ANGIOTENSIN AT1 Angiotensin II type 1a (AT-1a) receptor
Type:
Enzyme Catalytic Domain
Mol. Mass.:
41009.15
Organism:
RABBIT
Description:
ANGIOTENSIN AT1 AGTR1 RABBIT::P34976
Residue:
359
  
Inhibitor
Name:
BDBM50281942
Synonyms:
2-Butyl-3-[2'-(1H-tetrazol-5-yl)-biphenyl-4-ylmethyl]-6-trifluoromethyl-3H-quinazolin-4-one | CHEMBL24802
Type:
Small organic molecule
Emp. Form.:
C27H23F3N6O
Mol. Mass.:
504.5063
SMILES:
CCCCc1nc2ccc(cc2c(=O)n1Cc1ccc(cc1)-c1ccccc1-c1nnn[nH]1)C(F)(F)F
: